[Date Prev][Date Next][Thread Prev][Thread Next][Date Index][Thread Index]

make samlmod fails with perl 5.20.2, Centos 6



Hi,
I am trying to build Net::SAML via make samlmod, it builds with perl 5.18.2,
but with 5.20.2 I get compile errors. perl is installed vi perbrew:

Summary of my perl5 (revision 5 version 20 subversion 2) configuration:

  Platform:
    osname=linux, osvers=2.6.32-504.12.2.el6.x86_64, archname=x86_64-linux
    uname='linux furubukk.cbu.uib.no 2.6.32-504.12.2.el6.x86_64 #1 smp wed mar
11 22:03:14 utc 2015 x86_64 x86_64 x86_64 gnulinux '

This is Centos 6, full make output below.
Best
Michael

~/zxid-1.22 $ make samlmod
Makefile:220: Guessed TARGET=Linux
Nonverbose build (use make V=1 to enable verbose build).
TARGET=Linux
TOP=/home/licebasetest/zxid-1.22
CC=cc
CFLAGS=-g -fPIC -fno-strict-aliasing -fmessage-length=0 -Wall -Wno-parentheses
-Wno-unused-label -Wno-unknown-pragmas -Wno-char-subscripts
-ffunction-sections -fdata-sections
CDEF=-DUSE_ZXID -DUSE_SSL -DUSE_CURL -DUSE_OPENSSL -D_REENTRANT -DDEBUG
-DMUTEX_DEBUG=1 -DLINUX -DUSE_PTHREAD -pthread
CINC=-I. -I/home/licebasetest/zxid-1.22
LD=cc
LDFLAGS=
LIBS=-lcurl -lssl -lcrypto -lz  -lpthread
--------------------------
  Compiling c/zx-ns.c
  Compiling c/zx-attrs.c
  Compiling c/zx-elems.c
  Compiling zxlibdec.c
  Compiling zxlibenc.c
  Compiling zxlib.c
  Compiling zxns.c
  Compiling zxpw.c
  Compiling zxutil.c
  Compiling zxbusprod.c
  Compiling zxlog.c
  Compiling zxsig.c
  Compiling zxcrypto.c
  Compiling akbox_fn.c
  Compiling match.c
  Compiling c/license.c
  Compiling c/zx-di12-dec.c
  Compiling c/zx-sa11-dec.c
  Compiling c/zx-sp11-dec.c
  Compiling c/zx-a-dec.c
  Compiling c/zx-is12-dec.c
  Compiling c/zx-sbf-dec.c
  Compiling c/zx-wsse-dec.c
  Compiling c/zx-ac-dec.c
  Compiling c/zx-lu-dec.c
  Compiling c/zx-ds-dec.c
  Compiling c/zx-wsu-dec.c
  Compiling c/zx-b-dec.c
  Compiling c/zx-m20-dec.c
  Compiling c/zx-e-dec.c
  Compiling c/zx-sec-dec.c
  Compiling c/zx-xenc-dec.c
  Compiling c/zx-b12-dec.c
  Compiling c/zx-md-dec.c
  Compiling c/zx-sec12-dec.c
  Compiling c/zx-dec.c
  Compiling c/zx-ff12-dec.c
  Compiling c/zx-di-dec.c
  Compiling c/zx-sa-dec.c
  Compiling c/zx-sp-dec.c
  Compiling c/zx-is-dec.c
  Compiling c/zx-ecp-dec.c
  Compiling c/zx-paos-dec.c
  Compiling c/zx-dap-dec.c
  Compiling c/zx-ps-dec.c
  Compiling c/zx-im-dec.c
  Compiling c/zx-as-dec.c
  Compiling c/zx-subs-dec.c
  Compiling c/zx-dst-dec.c
  Compiling c/zx-cb-dec.c
  Compiling c/zx-cdm-dec.c
  Compiling c/zx-gl-dec.c
  Compiling c/zx-mm7-dec.c
  Compiling c/zx-wst-dec.c
  Compiling c/zx-wsp-dec.c
  Compiling c/zx-wsc-dec.c
  Compiling c/zx-xa-dec.c
  Compiling c/zx-xac-dec.c
  Compiling c/zx-xasa-dec.c
  Compiling c/zx-xasacd1-dec.c
  Compiling c/zx-xasp-dec.c
  Compiling c/zx-xaspcd1-dec.c
  Compiling c/zx-dp-dec.c
  Compiling c/zx-pmm-dec.c
  Compiling c/zx-prov-dec.c
  Compiling c/zx-idp-dec.c
  Compiling c/zx-shps-dec.c
  Compiling c/zx-exca-dec.c
  Compiling c/zx-hrxml-dec.c
  Compiling c/zx-idhrxml-dec.c
  Compiling c/zx-demomed-dec.c
  Compiling c/zx-xsi-dec.c
  Compiling c/zx-xs-dec.c
  Compiling c/zx-xml-dec.c
  Compiling c/zx-tas3-dec.c
  Compiling c/zx-tas3sol-dec.c
  Compiling c/zx-shibmd-dec.c
  Compiling c/zx-idpdisc-dec.c
  Compiling zxidsimp.c
zxidsimp.c: In function zxid_template_page_cf:
zxidsimp.c:423: warning: passing argument 2 of zx_free discards qualifiers
from pointer target type
zx.h:201: note: expected void * but argument is of type const char *
  Compiling zxidpool.c
  Compiling zxidpsso.c
  Compiling zxidsso.c
  Compiling zxidslo.c
  Compiling zxiddec.c
  Compiling zxidspx.c
  Compiling zxididpx.c
  Compiling zxidmni.c
  Compiling zxidpep.c
  Compiling zxidpdp.c
  Compiling zxidmk.c
  Compiling zxida7n.c
  Compiling zxidses.c
  Compiling zxiduser.c
  Compiling zxidcgi.c
  Compiling zxidconf.c
  Compiling zxidecp.c
  Compiling zxidcdc.c
  Compiling zxidloc.c
  Compiling zxidlib.c
  Compiling zxidmeta.c
  Compiling zxidmda.c
  Compiling zxidcurl.c
  Compiling zxidepr.c
  Compiling ykcrc.c
  Compiling ykaes.c
  Compiling zxidmkwsf.c
  Compiling zxidwsf.c
  Compiling zxidwsc.c
  Compiling zxidwsp.c
  Compiling zxiddi.c
  Compiling zxidim.c
  Compiling zxidps.c
  Compiling zxidoauth.c
  Compiling certauth.c
  Compiling keygen.c
  Compiling pkcs12.c
  Compiling smime-enc.c
smime-enc.c: In function smime_sign_engine:
smime-enc.c:183: warning: value computed is not used
smime-enc.c:194: warning: value computed is not used
smime-enc.c: In function encrypt1:
smime-enc.c:428: warning: value computed is not used
smime-enc.c:439: warning: value computed is not used
  Compiling smime-qry.c
  Compiling smime-vfy.c
smime-vfy.c: In function decrypt:
smime-vfy.c:218: warning: value computed is not used
  Compiling smimemime.c
  Compiling smimeutil.c
smimeutil.c: In function get_written_BIO_data:
smimeutil.c:150: warning: value computed is not used
ar -crs libzxid.a c/zx-ns.o c/zx-attrs.o c/zx-elems.o zxlibdec.o zxlibenc.o
zxlib.o zxns.o zxpw.o zxutil.o zxbusprod.o zxlog.o zxsig.o zxcrypto.o
akbox_fn.o match.o c/license.o c/zx-di12-dec.o c/zx-sa11-dec.o c/zx-sp11-dec.o
c/zx-a-dec.o c/zx-is12-dec.o c/zx-sbf-dec.o c/zx-wsse-dec.o c/zx-ac-dec.o
c/zx-lu-dec.o c/zx-ds-dec.o c/zx-wsu-dec.o c/zx-b-dec.o c/zx-m20-dec.o
c/zx-e-dec.o c/zx-sec-dec.o c/zx-xenc-dec.o c/zx-b12-dec.o c/zx-md-dec.o
c/zx-sec12-dec.o c/zx-dec.o c/zx-ff12-dec.o c/zx-di-dec.o c/zx-sa-dec.o
c/zx-sp-dec.o c/zx-is-dec.o c/zx-ecp-dec.o c/zx-paos-dec.o c/zx-dap-dec.o
c/zx-ps-dec.o c/zx-im-dec.o c/zx-as-dec.o c/zx-subs-dec.o c/zx-dst-dec.o
c/zx-cb-dec.o c/zx-cdm-dec.o c/zx-gl-dec.o c/zx-mm7-dec.o c/zx-wst-dec.o
c/zx-wsp-dec.o c/zx-wsc-dec.o c/zx-xa-dec.o c/zx-xac-dec.o c/zx-xasa-dec.o
c/zx-xasacd1-dec.o c/zx-xasp-dec.o c/zx-xaspcd1-dec.o c/zx-dp-dec.o
c/zx-pmm-dec.o c/zx-prov-dec.o c/zx-idp-dec.o c/zx-shps-dec.o c/zx-exca-dec.o
c/zx-hrxml-dec.o c/zx-idhrxml-dec.o c/zx-demomed-dec.o c/zx-xsi-dec.o
c/zx-xs-dec.o c/zx-xml-dec.o c/zx-tas3-dec.o c/zx-tas3sol-dec.o
c/zx-shibmd-dec.o c/zx-idpdisc-dec.o zxidsimp.o zxidpool.o zxidpsso.o
zxidsso.o zxidslo.o zxiddec.o zxidspx.o zxididpx.o zxidmni.o zxidpep.o
zxidpdp.o zxidmk.o zxida7n.o zxidses.o zxiduser.o zxidcgi.o zxidconf.o
zxidecp.o zxidcdc.o zxidloc.o zxidlib.o zxidmeta.o zxidmda.o zxidcurl.o
zxidepr.o ykcrc.o ykaes.o zxidmkwsf.o zxidwsf.o zxidwsc.o zxidwsp.o zxiddi.o
zxidim.o zxidps.o zxidoauth.o certauth.o keygen.o pkcs12.o smime-enc.o
smime-qry.o smime-vfy.o smimemime.o smimeutil.o
cd Net; perl Makefile.PL && make
Warning: -L.. changed to -L/home/licebasetest/zxid-1.22/Net/..
Generating a Unix-style Makefile
Writing Makefile for Net::SAML
Writing MYMETA.yml and MYMETA.json
cp SAML.pm blib/lib/Net/SAML.pm
cp SAML.pod blib/lib/Net/SAML.pod
Running Mkbootstrap for Net::SAML ()
chmod 644 "SAML.bs"
cc -c  -I.. -fwrapv -fno-strict-aliasing -pipe -fstack-protector
-I/usr/local/include -D_LARGEFILE_SOURCE -D_FILE_OFFSET_BITS=64 -O2
-DVERSION=\"\" -DXS_VERSION=\"\" -fPIC
"-I/home/licebasetest/perl5/perlbrew/perls/perl-5.20.2/lib/5.20.2/x86_64-linu
x/CORE"   SAML_wrap.c
SAML_wrap.c: In function SWIG_AsCharPtrAndSize:
SAML_wrap.c:1620: error: bool undeclared (first use in this function)
SAML_wrap.c:1620: error: (Each undeclared identifier is reported only once
SAML_wrap.c:1620: error: for each function it appears in.)
SAML_wrap.c:1620: error: expected : before numeric constant
SAML_wrap.c: In function _wrap_zx_str_n_get:
SAML_wrap.c:4418: error: bool undeclared (first use in this function)
SAML_wrap.c:4418: error: expected : before numeric constant
SAML_wrap.c: In function _wrap_new_zx_str:
SAML_wrap.c:4647: error: bool undeclared (first use in this function)
SAML_wrap.c:4647: error: expected : before numeric constant
SAML_wrap.c: In function _wrap_zx_attr_s_g_get:
SAML_wrap.c:4744: error: bool undeclared (first use in this function)
SAML_wrap.c:4744: error: expected : before numeric constant
SAML_wrap.c: In function _wrap_zx_elem_s_g_get:
SAML_wrap.c:5063: error: bool undeclared (first use in this function)
SAML_wrap.c:5063: error: expected : before numeric constant
SAML_wrap.c: In function _wrap_zx_ref_len_elem:
SAML_wrap.c:5525: warning: passing argument 2 of Perl_sv_2pv_flags from
incompatible pointer type
/home/licebasetest/perl5/perlbrew/perls/perl-5.20.2/lib/5.20.2/x86_64-linux/C
ORE/proto.h:3931: note: expected STRLEN * const but argument is of type int
*
SAML_wrap.c: In function _wrap_zx_dup_len_elem:
SAML_wrap.c:5637: warning: passing argument 2 of Perl_sv_2pv_flags from
incompatible pointer type
/home/licebasetest/perl5/perlbrew/perls/perl-5.20.2/lib/5.20.2/x86_64-linux/C
ORE/proto.h:3931: note: expected STRLEN * const but argument is of type int
*
SAML_wrap.c: In function _wrap_zx_ref_len_attr:
SAML_wrap.c:5749: warning: passing argument 2 of Perl_sv_2pv_flags from
incompatible pointer type
/home/licebasetest/perl5/perlbrew/perls/perl-5.20.2/lib/5.20.2/x86_64-linux/C
ORE/proto.h:3931: note: expected STRLEN * const but argument is of type int
*
SAML_wrap.c: In function _wrap_zx_dup_len_attr:
SAML_wrap.c:5919: warning: passing argument 2 of Perl_sv_2pv_flags from
incompatible pointer type
/home/licebasetest/perl5/perlbrew/perls/perl-5.20.2/lib/5.20.2/x86_64-linux/C
ORE/proto.h:3931: note: expected STRLEN * const but argument is of type int
*
SAML_wrap.c: In function _wrap_zx_ref_str:
SAML_wrap.c:6084: error: bool undeclared (first use in this function)
SAML_wrap.c:6084: error: expected : before numeric constant
SAML_wrap.c: In function _wrap_zx_ref_len_str:
SAML_wrap.c:6121: warning: passing argument 2 of Perl_sv_2pv_flags from
incompatible pointer type
/home/licebasetest/perl5/perlbrew/perls/perl-5.20.2/lib/5.20.2/x86_64-linux/C
ORE/proto.h:3931: note: expected STRLEN * const but argument is of type int
*
SAML_wrap.c:6126: error: bool undeclared (first use in this function)
SAML_wrap.c:6126: error: expected : before numeric constant
SAML_wrap.c: In function _wrap_zx_new_len_str:
SAML_wrap.c:6169: error: bool undeclared (first use in this function)
SAML_wrap.c:6169: error: expected : before numeric constant
SAML_wrap.c: In function _wrap_zx_dup_len_str:
SAML_wrap.c:6206: warning: passing argument 2 of Perl_sv_2pv_flags from
incompatible pointer type
/home/licebasetest/perl5/perlbrew/perls/perl-5.20.2/lib/5.20.2/x86_64-linux/C
ORE/proto.h:3931: note: expected STRLEN * const but argument is of type int
*
SAML_wrap.c:6211: error: bool undeclared (first use in this function)
SAML_wrap.c:6211: error: expected : before numeric constant
SAML_wrap.c: In function _wrap_zx_dup_str:
SAML_wrap.c:6255: error: bool undeclared (first use in this function)
SAML_wrap.c:6255: error: expected : before numeric constant
SAML_wrap.c: In function _wrap_zx_dup_zx_str:
SAML_wrap.c:6300: error: bool undeclared (first use in this function)
SAML_wrap.c:6300: error: expected : before numeric constant
SAML_wrap.c: In function _wrap_zx_strf:
SAML_wrap.c:6347: error: bool undeclared (first use in this function)
SAML_wrap.c:6347: error: expected : before numeric constant
SAML_wrap.c: In function _wrap_zx_raw_digest2:
SAML_wrap.c:8241: warning: passing argument 2 of Perl_sv_2pv_flags from
incompatible pointer type
/home/licebasetest/perl5/perlbrew/perls/perl-5.20.2/lib/5.20.2/x86_64-linux/C
ORE/proto.h:3931: note: expected STRLEN * const but argument is of type int
*
SAML_wrap.c: In function _wrap_zx_raw_cipher:
SAML_wrap.c:8324: warning: passing argument 2 of Perl_sv_2pv_flags from
incompatible pointer type
/home/licebasetest/perl5/perlbrew/perls/perl-5.20.2/lib/5.20.2/x86_64-linux/C
ORE/proto.h:3931: note: expected STRLEN * const but argument is of type int
*
SAML_wrap.c:8339: error: bool undeclared (first use in this function)
SAML_wrap.c:8339: error: expected : before numeric constant
SAML_wrap.c: In function _wrap_zx_rsa_pub_enc:
SAML_wrap.c:8406: error: bool undeclared (first use in this function)
SAML_wrap.c:8406: error: expected : before numeric constant
SAML_wrap.c: In function _wrap_zx_rsa_pub_dec:
SAML_wrap.c:8469: error: bool undeclared (first use in this function)
SAML_wrap.c:8469: error: expected : before numeric constant
SAML_wrap.c: In function _wrap_zx_rsa_priv_dec:
SAML_wrap.c:8532: error: bool undeclared (first use in this function)
SAML_wrap.c:8532: error: expected : before numeric constant
SAML_wrap.c: In function _wrap_zx_rsa_priv_enc:
SAML_wrap.c:8595: error: bool undeclared (first use in this function)
SAML_wrap.c:8595: error: expected : before numeric constant
SAML_wrap.c: In function _wrap_zx_EASY_ENC_elem:
SAML_wrap.c:9265: error: bool undeclared (first use in this function)
SAML_wrap.c:9265: error: expected : before numeric constant
SAML_wrap.c: In function _wrap_zxid_ses_wsp_msgid_get:
SAML_wrap.c:27592: error: bool undeclared (first use in this function)
SAML_wrap.c:27592: error: expected : before numeric constant
SAML_wrap.c: In function _wrap_zxid_ses_issuer_get:
SAML_wrap.c:29410: error: bool undeclared (first use in this function)
SAML_wrap.c:29410: error: expected : before numeric constant
SAML_wrap.c: In function _wrap_zxid_attr_map_val_get:
SAML_wrap.c:30079: error: bool undeclared (first use in this function)
SAML_wrap.c:30079: error: expected : before numeric constant
SAML_wrap.c: In function _wrap_zxid_attr_issuer_get:
SAML_wrap.c:30216: error: bool undeclared (first use in this function)
SAML_wrap.c:30216: error: expected : before numeric constant
SAML_wrap.c: In function _wrap_zxid_perm_eid_get:
SAML_wrap.c:33762: error: bool undeclared (first use in this function)
SAML_wrap.c:33762: error: expected : before numeric constant
SAML_wrap.c: In function _wrap_zxid_perm_qs_get:
SAML_wrap.c:33834: error: bool undeclared (first use in this function)
SAML_wrap.c:33834: error: expected : before numeric constant
SAML_wrap.c: In function _wrap_zxid_psobj_psobj_get:
SAML_wrap.c:33951: error: bool undeclared (first use in this function)
SAML_wrap.c:33951: error: expected : before numeric constant
SAML_wrap.c: In function _wrap_zxid_psobj_idpnid_get:
SAML_wrap.c:34095: error: bool undeclared (first use in this function)
SAML_wrap.c:34095: error: expected : before numeric constant
SAML_wrap.c: In function _wrap_zxid_psobj_dispname_get:
SAML_wrap.c:34167: error: bool undeclared (first use in this function)
SAML_wrap.c:34167: error: expected : before numeric constant
SAML_wrap.c: In function _wrap_zxid_psobj_tags_get:
SAML_wrap.c:34239: error: bool undeclared (first use in this function)
SAML_wrap.c:34239: error: expected : before numeric constant
SAML_wrap.c: In function _wrap_zxid_psobj_invids_get:
SAML_wrap.c:34311: error: bool undeclared (first use in this function)
SAML_wrap.c:34311: error: expected : before numeric constant
SAML_wrap.c: In function _wrap_zxid_invite_invid_get:
SAML_wrap.c:34753: error: bool undeclared (first use in this function)
SAML_wrap.c:34753: error: expected : before numeric constant
SAML_wrap.c: In function _wrap_zxid_invite_desc_get:
SAML_wrap.c:34897: error: bool undeclared (first use in this function)
SAML_wrap.c:34897: error: expected : before numeric constant
SAML_wrap.c: In function _wrap_zxid_invite_psobj_get:
SAML_wrap.c:34969: error: bool undeclared (first use in this function)
SAML_wrap.c:34969: error: expected : before numeric constant
SAML_wrap.c: In function _wrap_zxid_invite_ps2spredir_get:
SAML_wrap.c:35041: error: bool undeclared (first use in this function)
SAML_wrap.c:35041: error: expected : before numeric constant
SAML_wrap.c: In function _wrap_zxid_idp_select_zxstr_cf:
SAML_wrap.c:36393: error: bool undeclared (first use in this function)
SAML_wrap.c:36393: error: expected : before numeric constant
SAML_wrap.c: In function _wrap_zxid_template_page_cf:
SAML_wrap.c:36745: error: bool undeclared (first use in this function)
SAML_wrap.c:36745: error: expected : before numeric constant
SAML_wrap.c: In function _wrap_zxsig_ref_id_get:
SAML_wrap.c:36957: error: bool undeclared (first use in this function)
SAML_wrap.c:36957: error: expected : before numeric constant
SAML_wrap.c: In function _wrap_zxsig_ref_canon_get:
SAML_wrap.c:37029: error: bool undeclared (first use in this function)
SAML_wrap.c:37029: error: expected : before numeric constant
SAML_wrap.c: In function _wrap_zxenc_privkey_dec:
SAML_wrap.c:37190: error: bool undeclared (first use in this function)
SAML_wrap.c:37190: error: expected : before numeric constant
SAML_wrap.c: In function _wrap_zxenc_symkey_dec:
SAML_wrap.c:37313: error: bool undeclared (first use in this function)
SAML_wrap.c:37313: error: expected : before numeric constant
SAML_wrap.c: In function _wrap_zxid_sp_meta:
SAML_wrap.c:39284: error: bool undeclared (first use in this function)
SAML_wrap.c:39284: error: expected : before numeric constant
SAML_wrap.c: In function _wrap_zxid_sp_carml:
SAML_wrap.c:39359: error: bool undeclared (first use in this function)
SAML_wrap.c:39359: error: expected : before numeric constant
SAML_wrap.c: In function _wrap_zxid_my_ent_id:
SAML_wrap.c:39394: error: bool undeclared (first use in this function)
SAML_wrap.c:39394: error: expected : before numeric constant
SAML_wrap.c: In function _wrap_zxid_my_cdc_url:
SAML_wrap.c:39505: error: bool undeclared (first use in this function)
SAML_wrap.c:39505: error: expected : before numeric constant
SAML_wrap.c: In function _wrap_zxid_show_conf:
SAML_wrap.c:40156: error: bool undeclared (first use in this function)
SAML_wrap.c:40156: error: expected : before numeric constant
SAML_wrap.c: In function _wrap_zxid_ses_to_ldif:
SAML_wrap.c:40661: error: bool undeclared (first use in this function)
SAML_wrap.c:40661: error: expected : before numeric constant
SAML_wrap.c: In function _wrap_zxid_ses_to_json:
SAML_wrap.c:40706: error: bool undeclared (first use in this function)
SAML_wrap.c:40706: error: expected : before numeric constant
SAML_wrap.c: In function _wrap_zxid_ses_to_qs:
SAML_wrap.c:40751: error: bool undeclared (first use in this function)
SAML_wrap.c:40751: error: expected : before numeric constant
SAML_wrap.c: In function _wrap_zxid_http_post_raw:
SAML_wrap.c:41304: error: bool undeclared (first use in this function)
SAML_wrap.c:41304: error: expected : before numeric constant
SAML_wrap.c: In function _wrap_zx_easy_enc_elem_opt:
SAML_wrap.c:41585: error: bool undeclared (first use in this function)
SAML_wrap.c:41585: error: expected : before numeric constant
SAML_wrap.c: In function _wrap_zx_easy_enc_elem_sig:
SAML_wrap.c:41630: error: bool undeclared (first use in this function)
SAML_wrap.c:41630: error: expected : before numeric constant
SAML_wrap.c: In function _wrap_zxid_date_time:
SAML_wrap.c:41681: error: bool undeclared (first use in this function)
SAML_wrap.c:41681: error: expected : before numeric constant
SAML_wrap.c: In function _wrap_zxid_mk_id:
SAML_wrap.c:41733: error: bool undeclared (first use in this function)
SAML_wrap.c:41733: error: expected : before numeric constant
SAML_wrap.c: In function _wrap_zxid_saml2_post_enc:
SAML_wrap.c:41945: error: bool undeclared (first use in this function)
SAML_wrap.c:41945: error: expected : before numeric constant
SAML_wrap.c: In function _wrap_zxid_saml2_redir_enc:
SAML_wrap.c:42016: error: bool undeclared (first use in this function)
SAML_wrap.c:42016: error: expected : before numeric constant
SAML_wrap.c: In function _wrap_zxid_saml2_redir_url:
SAML_wrap.c:42082: error: bool undeclared (first use in this function)
SAML_wrap.c:42082: error: expected : before numeric constant
SAML_wrap.c: In function _wrap_zxid_saml2_redir:
SAML_wrap.c:42148: error: bool undeclared (first use in this function)
SAML_wrap.c:42148: error: expected : before numeric constant
SAML_wrap.c: In function _wrap_zxid_saml2_resp_redir:
SAML_wrap.c:42214: error: bool undeclared (first use in this function)
SAML_wrap.c:42214: error: expected : before numeric constant
SAML_wrap.c: In function _wrap_zxid_decrypt_newnym:
SAML_wrap.c:42378: error: bool undeclared (first use in this function)
SAML_wrap.c:42378: error: expected : before numeric constant
SAML_wrap.c: In function _wrap_zxid_sp_slo_redir:
SAML_wrap.c:43056: error: bool undeclared (first use in this function)
SAML_wrap.c:43056: error: expected : before numeric constant
SAML_wrap.c: In function _wrap_zxid_sp_mni_redir:
SAML_wrap.c:43177: error: bool undeclared (first use in this function)
SAML_wrap.c:43177: error: expected : before numeric constant
SAML_wrap.c: In function _wrap_zxid_mk_oauth_az_req:
SAML_wrap.c:43753: error: bool undeclared (first use in this function)
SAML_wrap.c:43753: error: expected : before numeric constant
SAML_wrap.c: In function _wrap_zxid_wsp_decorate:
SAML_wrap.c:44885: error: bool undeclared (first use in this function)
SAML_wrap.c:44885: error: expected : before numeric constant
SAML_wrap.c: In function _wrap_zxid_wsp_decoratef:
SAML_wrap.c:44953: error: bool undeclared (first use in this function)
SAML_wrap.c:44953: error: expected : before numeric constant
SAML_wrap.c: In function _wrap_zxid_call:
SAML_wrap.c:45115: error: bool undeclared (first use in this function)
SAML_wrap.c:45115: error: expected : before numeric constant
SAML_wrap.c: In function _wrap_zxid_callf:
SAML_wrap.c:45216: error: bool undeclared (first use in this function)
SAML_wrap.c:45216: error: expected : before numeric constant
SAML_wrap.c: In function _wrap_zxid_call_epr:
SAML_wrap.c:45297: error: bool undeclared (first use in this function)
SAML_wrap.c:45297: error: expected : before numeric constant
SAML_wrap.c: In function _wrap_zxid_callf_epr:
SAML_wrap.c:45375: error: bool undeclared (first use in this function)
SAML_wrap.c:45375: error: expected : before numeric constant
SAML_wrap.c: In function _wrap_zxid_wsc_prepare_call:
SAML_wrap.c:45452: error: bool undeclared (first use in this function)
SAML_wrap.c:45452: error: expected : before numeric constant
SAML_wrap.c: In function _wrap_zxid_wsc_prepare_callf:
SAML_wrap.c:45530: error: bool undeclared (first use in this function)
SAML_wrap.c:45530: error: expected : before numeric constant
SAML_wrap.c: In function _wrap_zxid_get_epr_address:
SAML_wrap.c:45825: error: bool undeclared (first use in this function)
SAML_wrap.c:45825: error: expected : before numeric constant
SAML_wrap.c: In function _wrap_zxid_get_epr_entid:
SAML_wrap.c:45870: error: bool undeclared (first use in this function)
SAML_wrap.c:45870: error: expected : before numeric constant
SAML_wrap.c: In function _wrap_zxid_get_epr_desc:
SAML_wrap.c:45915: error: bool undeclared (first use in this function)
SAML_wrap.c:45915: error: expected : before numeric constant
SAML_wrap.c: In function _wrap_zxid_get_epr_tas3_trust:
SAML_wrap.c:45960: error: bool undeclared (first use in this function)
SAML_wrap.c:45960: error: expected : before numeric constant
SAML_wrap.c: In function _wrap_zxid_get_epr_secmech:
SAML_wrap.c:46005: error: bool undeclared (first use in this function)
SAML_wrap.c:46005: error: expected : before numeric constant
SAML_wrap.c: In function _wrap_zxid_epr2str:
SAML_wrap.c:46510: error: bool undeclared (first use in this function)
SAML_wrap.c:46510: error: expected : before numeric constant
SAML_wrap.c: In function _wrap_zxid_token2str:
SAML_wrap.c:46555: error: bool undeclared (first use in this function)
SAML_wrap.c:46555: error: expected : before numeric constant
SAML_wrap.c: In function _wrap_zxid_a7n2str:
SAML_wrap.c:46638: error: bool undeclared (first use in this function)
SAML_wrap.c:46638: error: expected : before numeric constant
SAML_wrap.c: In function _wrap_zxid_nid2str:
SAML_wrap.c:46721: error: bool undeclared (first use in this function)
SAML_wrap.c:46721: error: expected : before numeric constant
make[1]: *** [SAML_wrap.o] Error 1
make: *** [samlmod] Error 2

[demime 1.01d removed an attachment of type application/pgp-signature which had a name of signature.asc]